{"text_format":"1","workbook":"xlsx","n_sheets":11,"sheets":["Introduction","Assumptions","Farrow-Finish Summary","Risk Analysis","Farrow Input","Feed Input","Feed-Summary","Farrow Finish Worksheet","Finish-O","Weaner-O","Ingredient-Summary"],"not_rendered":{"charts":0,"images":3,"macros":1,"external_links":1,"defined_names":69,"comments":2,"pivot_tables":0},"unopened":[],"bounds":{"document_bytes":16777216,"sheet_cells":100000,"rows_first":2000,"rows_last":500,"rows_between":2000,"halvings":0,"cell_chars":16384,"cell_head_chars":4096},"cells_cut":0,"cells_raw":0,"read":"whole","date_system":"1900"}

{"sheet":"Introduction","index":0,"n_rows":88,"n_cols":8,"rows_kept":88,"cut":false,"hidden":false,"merged":[[27,1,37,8],[58,1,60,8],[4,1,4,8],[5,1,5,8],[6,1,6,8],[62,1,62,8],[7,1,7,8],[17,1,25,8]]}
[]
[]
[". . . . . . . . . . . . . . . . . . . . . . . . . . . . . . . . . . . . . . . . . . . . . . . . . "]
[]
[null,"Guidelines For Estimating"]
[null,"Swine Farrow-Finish Costs"]
[null,{"$f":"\"Based On \"&'Farrow Input'!G13&\" Sows and \"&FIXED('Farrow Input'!F79,0)&\" Pigs Sold\"","v":"Based On 500 Sows and 13,002 Pigs Sold"}]
[]
[]
[]
[]
[null,null,null,null,null,null,"Date:","April, 2023"]
[]
[]
[]
{"$rows_left_out":74}
{"sheet":"Assumptions","index":1,"n_rows":26,"n_cols":2,"rows_kept":26,"cut":false,"hidden":false,"merged":[[20,1,23,7],[25,1,30,7],[1,1,1,7],[10,1,13,7],[15,1,18,7],[3,1,8,7]]}
[]
[null,"Farrow-Finish Pig Cost of Production"]
[]
[null,{"$f":"\"The following farrow to finish budget is based on the assumption that all feed is purchased or home-mixed. The budget includes a land investment cost for \"&'Farrow Input'!G211&\" acres, with \"&'Farrow Input'!G212&\" acres rented out at $\"&'Farrow Input'!G213&\" per acre, of the estimated \"&ROUND(((('Farrow Finish Worksheet'!D258*'Farrow Input'!F177)/(40.768*2))*2.4709661),0)&\" to \"&ROUND(((('Farrow Finish Worksheet'!D258*'Farrow Input'!F177)/(26.362*2))*2.4709661),0)&\" acres of total landbase that would be required for this size of livestock operation.  This land base falls within the 2XP2O5 application rate, soil phosphorus levels permitting.\"","v":"The following farrow to finish budget is based on the assumption that all feed is purchased or home-mixed. The budget includes a land investment cost for 40 acres, with 0 acres rented out at $80 per acre, of the estimated 233 to 361 acres of total landbase that would be required for this size of livestock operation.  This land base falls within the 2XP2O5 application rate, soil phosphorus levels permitting."}]
[]
[]
[]
[]
[]
[]
[null,"The budget includes an assumption that 1.75% of the market pigs are sold as lightweight pigs. It is assumed that when the lightweight pigs are sold, they will have a salvage value. Therefore, total marketings are reduced by only 1% to compensate for the lightweight pigs. "]
[]
[]
[]
[]
{"$rows_left_out":12}
{"sheet":"Farrow-Finish Summary","index":2,"n_rows":78,"n_cols":13,"rows_kept":78,"cut":false,"hidden":false,"merged":[[77,0,78,12],[1,4,1,6],[1,8,1,10],[0,0,0,12],[52,0,52,12]]}
[{"$f":"'Farrow Input'!G13&\" Sow Farrow-Finish Cost of Production Summary - \"&Introduction!H12","v":"500 Sow Farrow-Finish Cost of Production Summary - April, 2023"}]
[null,null,null,null,"Purchased Feed",null,null,null,"Home-Mixed Feed"]
[null,null,null,null,"$/Pig","$/Sow","Total",null,"$/Pig","$/Sow","Total",null,"Your "]
["A. Operating Costs",null,null,null,"Sold","/Year","Cost",null,"Sold","/Year","Cost",null,"Cost"]
["1.","Feed Costs:"]
[null,1.01,"Sow Lactation ",null,{"$f":"'Farrow Finish Worksheet'!D16","v":7.9698284498790057},{"$f":"E6*'Farrow Input'!$G$79","v":207.24456899999998},{"$f":"E6*'Farrow Input'!$F$79","v":103622.28449999999},null,{"$f":"'Farrow Finish Worksheet'!D25","v":5.8635439883241141},{"$f":"I6*'Farrow Input'!$G$79","v":152.47350106905003},{"$f":"I6*'Farrow Input'!$F$79","v":76236.750534525025}]
[null,1.02,"Sow Gestation ",null,{"$f":"'Farrow Finish Worksheet'!D35","v":19.64677159035228},{"$f":"E7*'Farrow Input'!$G$79","v":510.88762274999999},{"$f":"E7*'Farrow Input'!$F$79","v":255443.81137499999},null,{"$f":"'Farrow Finish Worksheet'!D44","v":13.959678959802185},{"$f":"I7*'Farrow Input'!$G$79","v":363.00249968949998},{"$f":"I7*'Farrow Input'!$F$79","v":181501.24984475001}]
[null,1.03,"Boar Ration",null,{"$f":"'Farrow Finish Worksheet'!D53","v":0.13168504812600262},{"$f":"E8*'Farrow Input'!$G$79","v":3.4242909008953624},{"$f":"E8*'Farrow Input'!$F$79","v":1712.1454504476812},null,{"$f":"'Farrow Finish Worksheet'!D61","v":9.6227127251348993E-2},{"$f":"I8*'Farrow Input'!$G$79","v":2.5022558062233742},{"$f":"I8*'Farrow Input'!$F$79","v":1251.1279031116871}]
[null,1.04,"Pre Starter 1",null,{"$f":"'Farrow Finish Worksheet'!D73","v":1.4332915145764347},{"$f":"E9*'Farrow Input'!$G$79","v":37.270799999999994},{"$f":"E9*'Farrow Input'!$F$79","v":18635.399999999998},null,{"$f":"'Farrow Finish Worksheet'!D84","v":0.80021265449624079},{"$f":"I9*'Farrow Input'!$G$79","v":20.808443711474997},{"$f":"I9*'Farrow Input'!$F$79","v":10404.2218557375}]
[null,1.05,"Pre Starter 2",null,{"$f":"'Farrow Finish Worksheet'!D96","v":4.9296936378420568},{"$f":"E10*'Farrow Input'!$G$79","v":128.18999049999996},{"$f":"E10*'Farrow Input'!$F$79","v":64094.995249999978},null,{"$f":"'Farrow Finish Worksheet'!D107","v":2.6215416356825449},{"$f":"I10*'Farrow Input'!$G$79","v":68.169631230999983},{"$f":"I10*'Farrow Input'!$F$79","v":34084.815615499989}]
[null,1.06,"Starter 1",null,{"$f":"'Farrow Finish Worksheet'!D119","v":11.38291034182196},{"$f":"E11*'Farrow Input'!$G$79","v":295.99713000000003},{"$f":"E11*'Farrow Input'!$F$79","v":147998.565},null,{"$f":"'Farrow Finish Worksheet'!D130","v":6.6488858578615879},{"$f":"I11*'Farrow Input'!$G$79","v":172.89525020624995},{"$f":"I11*'Farrow Input'!$F$79","v":86447.625103124985}]
[null,1.07,"Starter 2",null,{"$f":"'Farrow Finish Worksheet'!D142","v":13.648100006174518},{"$f":"E12*'Farrow Input'!$G$79","v":354.90031199999999},{"$f":"E12*'Farrow Input'!$F$79","v":177450.15599999999},null,{"$f":"'Farrow Finish Worksheet'!D153","v":9.550191101689661},{"$f":"I12*'Farrow Input'!$G$79","v":248.33975425999998},{"$f":"I12*'Farrow Input'!$F$79","v":124169.87712999999}]
[null,1.08,"Starter",null,{"$f":"'Farrow Finish Worksheet'!D161","v":18.552534000000005},{"$f":"E13*'Farrow Input'!$G$79","v":482.43345974984175},{"$f":"E13*'Farrow Input'!$F$79","v":241216.72987492086},null,{"$f":"'Farrow Finish Worksheet'!D168","v":13.49647845},{"$f":"I13*'Farrow Input'!$G$79","v":350.95759927310627},{"$f":"I13*'Farrow Input'!$F$79","v":175478.79963655313}]
[null,1.0900000000000001,"Grower ",null,{"$f":"'Farrow Finish Worksheet'!D176","v":90.832499999999996},{"$f":"E14*'Farrow Input'!$G$79","v":2361.9758482980001},{"$f":"E14*'Farrow Input'!$F$79","v":1180987.9241490001},null,{"$f":"'Farrow Finish Worksheet'!D183","v":72.826400624999991},{"$f":"I14*'Farrow Input'!$G$79","v":1893.7516791316364},{"$f":"I14*'Farrow Input'!$F$79","v":946875.8395658182}]
["",1.1000000000000001,"Finisher ",null,{"$f":"'Farrow Finish Worksheet'!D191","v":50.363950000000003},{"$f":"E15*'Farrow Input'!$G$79","v":1309.6461456514801},{"$f":"E15*'Farrow Input'!$F$79","v":654823.07282574009},null,{"$f":"'Farrow Finish Worksheet'!D198","v":35.313824000000004},{"$f":"I15*'Farrow Input'!$G$79","v":918.28805107253777},{"$f":"I15*'Farrow Input'!$F$79","v":459144.02553626883}]
{"$rows_left_out":64}
{"sheet":"Risk Analysis","index":3,"n_rows":51,"n_cols":5,"rows_kept":51,"cut":false,"hidden":false,"merged":[[0,0,0,7],[50,0,52,7]]}
["Risk & Sensitivity Analysis"]
[]
[null,null,"Purchased Feed",null,"Home-Mixed Feed"]
[null,null,"Per Pig",null,"Per Pig"]
["A.  Operating Costs"]
[null,"Feed cost",{"$f":"'Farrow-Finish Summary'!E16","v":218.89126458877223},null,{"$f":"'Farrow-Finish Summary'!I16","v":161.17698440010767}]
[null,"Other Operating Costs",{"$f":"SUM(C8-C6)","v":41.128488956343404},null,{"$f":"SUM(E8-E6)","v":39.858379488903807}]
[null,"Subtotal",{"$f":"'Farrow-Finish Summary'!E31","v":260.01975354511563},null,{"$f":"'Farrow-Finish Summary'!I31","v":201.03536388901148}]
["B.  Fixed Costs",null,{"$f":"'Farrow-Finish Summary'!E45","v":25.567553048517027},null,{"$f":"'Farrow-Finish Summary'!I45","v":26.229623759041793}]
["C.  Labour",null,{"$f":"'Farrow-Finish Summary'!E50","v":18.141458521210858},null,{"$f":"'Farrow-Finish Summary'!I50","v":18.141458521210858}]
["Total Costs",null,{"$f":"SUM(C8:C10)","v":303.7287651148435},null,{"$f":"SUM(E8:E10)","v":245.40644616926414}]
[]
["Estimated Farmgate"]
[null,"Price ($ per 100kg)",{"$f":"'Farrow-Finish Summary'!E56","v":202},null,{"$f":"'Farrow-Finish Summary'!I56","v":202}]
[]
{"$rows_left_out":37}
{"sheet":"Farrow Input","index":4,"n_rows":218,"n_cols":13,"rows_kept":218,"cut":false,"hidden":false,"merged":[[124,1,124,4],[102,1,102,4],[1,0,1,10],[10,0,10,10],[30,7,30,8],[51,0,51,10],[125,1,125,4],[93,3,93,7],[130,0,130,8],[70,1,70,10],[71,1,71,10],[83,7,83,8],[82,6,82,7],[101,1,101,4],[109,1,109,4],[110,1,110,4]]}
[]
["Farrow - Finish Pig Production Costs"]
[]
[1," This input table outlines the cost of production for a farrow finish operation."]
[2," Buildings and equipment are valued at new cost."]
[3," Purchased feed is used for creep and starter all other feed is home mixed."]
[4," Manure haulage is contracted out."]
[5," Gilts are purchased for herd replacement."]
[6," No weaner pigs are sold."]
[]
["Farrow - Wean Pig Production Assumptions"]
["Indicators of Productivity"]
["Sows",null,null,null,null,null,500]
["Boars",null,null,null,null,null,3]
["Litters/Sow/Year",null,null,null,null,null,2.38]
{"$rows_left_out":204}
{"sheet":"Feed Input","index":5,"n_rows":240,"n_cols":9,"rows_kept":240,"cut":false,"hidden":false,"merged":[[0,0,0,6]]}
[" Feed Ingredient Costs"]
[]
[null,null,null,null,"Price ($/tonne)","Your Cost"]
[null,"  Wheat",null,null,370]
[null,"  Barley ",null,null,320]
[null,"  Corn ",null,null,355]
[null,"  Soybean Meal ",null,null,665]
[null,"  Canola Meal",null,null,425]
[null,"  Peas ",null,null,390]
[null,"  Sow Micro Premix ",null,null,4000]
[null,"  Grower Micro Premix ",null,null,8000]
[null,"  Canola Oil ",null,null,2400]
[null,"  Whey Powder ",null,null,1364.6]
[null,"  Fish Meal",null,null,3364.4]
[null,"  Plasma",null,null,5270]
{"$rows_left_out":226}
{"sheet":"Feed-Summary","index":6,"n_rows":263,"n_cols":10,"rows_kept":263,"cut":false,"hidden":false,"merged":[[1,0,1,9]]}
[]
["Feed Requirement and Cost Summary"]
[null,null,null,"Amount",null,"    Price",null,"Ration Cost"]
[null,null,null,"(kg)",null,"($ /tonne)",null,"($ /tonne)",null,"Your Cost"]
["Sow Gestation"]
[{"$f":"'Feed Input'!B4","v":"  Wheat"},null,null,{"$f":"IF('Feed Input'!D32=0,\" \",'Feed Input'!D32)","v":" "},null,{"$f":"IF('Feed Input'!D32=0,\" \",'Feed Input'!E4)","v":" "},null,{"$f":"IF('Feed Input'!D32=0,\" \",ROUND((D6/1000)*F6,2))","v":" "}]
[{"$f":"'Feed Input'!B5","v":"  Barley "},null,null,{"$f":"IF('Feed Input'!D33=0,\" \",'Feed Input'!D33)","v":877},null,{"$f":"IF('Feed Input'!D33=0,\" \",'Feed Input'!E5)","v":320},null,{"$f":"IF('Feed Input'!D33=0,\" \",ROUND((D7/1000)*F7,2))","v":280.64}]
[{"$f":"'Feed Input'!B6","v":"  Corn "},null,null,{"$f":"IF('Feed Input'!D34=0,\" \",'Feed Input'!D34)","v":" "},null,{"$f":"IF('Feed Input'!D34=0,\" \",'Feed Input'!E6)","v":" "},null,{"$f":"IF('Feed Input'!D34=0,\" \",ROUND((D8/1000)*F8,2))","v":" "}]
[{"$f":"'Feed Input'!B7","v":"  Soybean Meal "},null,null,{"$f":"IF('Feed Input'!D35=0,\" \",'Feed Input'!D35)","v":" "},null,{"$f":"IF('Feed Input'!D35=0,\" \",'Feed Input'!E7)","v":" "},null,{"$f":"IF('Feed Input'!D35=0,\" \",ROUND((D9/1000)*F9,2))","v":" "}]
[{"$f":"'Feed Input'!B8","v":"  Canola Meal"},null,null,{"$f":"IF('Feed Input'!D36=0,\" \",'Feed Input'!D36)","v":87},null,{"$f":"IF('Feed Input'!D36=0,\" \",'Feed Input'!E8)","v":425},null,{"$f":"IF('Feed Input'!D36=0,\" \",ROUND((D10/1000)*F10,2))","v":36.979999999999997}]
[{"$f":"'Feed Input'!B9","v":"  Peas "},null,null,{"$f":"IF('Feed Input'!D37=0,\" \",'Feed Input'!D37)","v":" "},null,{"$f":"IF('Feed Input'!D37=0,\" \",'Feed Input'!E9)","v":" "},null,{"$f":"IF('Feed Input'!D37=0,\" \",ROUND((D11/1000)*F11,2))","v":" "}]
[{"$f":"'Feed Input'!B10","v":"  Sow Micro Premix "},null,null,{"$f":"IF('Feed Input'!D38=0,\" \",'Feed Input'!D38)","v":5},null,{"$f":"IF('Feed Input'!D38=0,\" \",'Feed Input'!E10)","v":4000},null,{"$f":"IF('Feed Input'!D38=0,\" \",ROUND((D12/1000)*F12,2))","v":20}]
[{"$f":"'Feed Input'!B11","v":"  Grower Micro Premix "},null,null,{"$f":"IF('Feed Input'!D39=0,\" \",'Feed Input'!D39)","v":" "},null,{"$f":"IF('Feed Input'!D39=0,\" \",'Feed Input'!E11)","v":" "},null,{"$f":"IF('Feed Input'!D39=0,\" \",ROUND((D13/1000)*F13,2))","v":" "}]
[{"$f":"'Feed Input'!B12","v":"  Canola Oil "},null,null,{"$f":"IF('Feed Input'!D40=0,\" \",'Feed Input'!D40)","v":" "},null,{"$f":"IF('Feed Input'!D40=0,\" \",'Feed Input'!E12)","v":" "},null,{"$f":"IF('Feed Input'!D40=0,\" \",ROUND((D14/1000)*F14,2))","v":" "}]
[{"$f":"'Feed Input'!B13","v":"  Whey Powder "},null,null,{"$f":"IF('Feed Input'!D41=0,\" \",'Feed Input'!D41)","v":" "},null,{"$f":"IF('Feed Input'!D41=0,\" \",'Feed Input'!E13)","v":" "},null,{"$f":"IF('Feed Input'!D41=0,\" \",ROUND((D15/1000)*F15,2))","v":" "}]
{"$rows_left_out":249}
{"sheet":"Farrow Finish Worksheet","index":7,"n_rows":483,"n_cols":10,"rows_kept":483,"cut":false,"hidden":false,"merged":[[1,0,1,9],[478,2,478,7],[480,3,483,9],[371,3,371,5],[372,3,372,5],[403,2,403,9],[353,1,353,6],[476,3,477,8]]}
[]
["Farrow Finish Pig Production Cost Worksheet"]
[null,null,null,null,null,null,null,null,null,"Your Cost"]
["A. Operating Costs"]
[]
["1. Feed Requirements and Costs"]
[]
[null,"1.01  Sow Lactation - Purchased Feed"]
[null,null,"",{"$f":"'Farrow Input'!G16","v":21},null,"days average weaning age"]
[null,null,"x",{"$f":"'Farrow Input'!G15","v":2.38},null,"litters/sow/year"]
[null,null,"=",{"$f":"D9*D10","v":49.98},null,"days lactation"]
[null,null,"x",{"$f":"'Farrow Input'!E33","v":6.53},null,"kg ration/day"]
[null,null,"x",{"$f":"'Farrow Input'!G33","v":635},null,"/tonne ration"]
[null,null,"÷",1000,null,"kg/tonne"]
[null,null,"÷",{"$f":"'Farrow Input'!$G$79","v":26.0036424},null,"pigs sold/sow/year"]
{"$rows_left_out":469}
{"sheet":"Finish-O","index":8,"n_rows":60,"n_cols":11,"rows_kept":60,"cut":false,"hidden":true,"merged":[]}
[]
[]
[null,"============================================================================="]
[null,"","","GROWING AND FINISHING PIG PRODUCTION SUMMARY"]
[null,"","","",null,"","","","","",""]
[null,"============================================================================="]
[null,"A. OPERATING COSTS",null,null,null,null,"","","TOTAL","$/HOG SOLD","$/PLACE"]
[null,"","1.","Feed Costs:",null,null,null,"","-----------------------------------------------------------------------"]
[null,"","","1.01","Grower Ration #1",null,null,null,{"$f":"J9*'Farrow Input'!F79","v":416708.36945999996},{"$f":"ROUND('Farrow Input'!E85*SUM('Farrow Input'!G85:H85)/1000,2)","v":32.049999999999997},{"$f":"J9*'Farrow Input'!F79/'Farrow Input'!I70","v":96.98467103791161}]
[null,null,null,"1.02","Grower Ration #2",null,null,null,{"$f":"J10*'Farrow Input'!F79","v":2127878.0575919999},{"$f":"ROUND('Farrow Input'!E86*SUM('Farrow Input'!G86:H86)/1000,2)","v":163.66},{"$f":"J10*'Farrow Input'!F79/'Farrow Input'!I70","v":495.24216106285849}]
[null,"","","1.02","Finisher Ration",null,null,null,{"$f":"J11*'Farrow Input'!F79","v":1113996.0404160002},{"$f":"ROUND('Farrow Input'!E87*SUM('Farrow Input'!G87:H87)/1000,2)","v":85.68},{"$f":"J11*'Farrow Input'!F79/'Farrow Input'!I70","v":259.27134522709105}]
[null,"","","","",null,null,null,"=================================================="]
[null,"","","Total Feed Cost",null,null,null,null,{"$f":"SUM(I9:I12)","v":3658582.467468},{"$f":"SUM(J9:J12)","v":281.39},{"$f":"SUM(K9:K12)","v":851.49817732786119}]
[null,"","","","",null,null,null,"","",""]
[null,"","2.","Other Operating Costs:",null,null,null,null,"","",""]
{"$rows_left_out":46}
{"sheet":"Weaner-O","index":9,"n_rows":63,"n_cols":10,"rows_kept":63,"cut":false,"hidden":true,"merged":[]}
[]
[]
[null,"============================================================================="]
[null,"","WEANER PIG PRODUCTION COST SUMMARY",null,null,null,null,null,"",""]
[null,"","","","","","","","",""]
[null,"============================================================================="]
[null,"A.","OPERATING COSTS",null,null,null,null,"     TOTAL","$/HOG SOLD","$/SOW/YR"]
[null,"","1.","Feed Costs:",null,"","","------------------------------------------------------------------------"]
[null,"","","A1","Sow Lactation Ration",null,null,{"$f":"ROUND('Farrow Input'!G16*'Farrow Input'!F24*'Farrow Input'!E33*'Farrow Input'!M33/1000*'Farrow Input'!G13,2)","v":179859.04},{"$f":"ROUND(J9/'Farrow Input'!$G$79,2)","v":13.83},{"$f":"ROUND('Farrow Input'!G16*'Farrow Input'!F24*'Farrow Input'!E33*'Farrow Input'!M33/1000,2)","v":359.72}]
[null,"","","1.02","Sow Gestation Ration",null,null,{"$f":"ROUND((365-'Farrow Input'!G16*'Farrow Input'!F24)*'Farrow Input'!E32*'Farrow Input'!M32/1000*'Farrow Input'!G13,2)","v":436945.06},{"$f":"ROUND(J10/'Farrow Input'!$G$79,2)","v":33.61},{"$f":"ROUND((365-'Farrow Input'!G16*'Farrow Input'!F24)*'Farrow Input'!E32*'Farrow Input'!M32/1000,2)","v":873.89}]
[null,"","","1.03","Boar Ration",null,null,{"$f":"ROUND(365*'Farrow Input'!E34*'Farrow Input'!M34/1000*'Farrow Input'!E23/'Farrow Input'!E22*'Farrow Input'!G13,2)","v":3125.59},{"$f":"ROUND(J11/'Farrow Input'!$G$79,2)","v":0.24},{"$f":"ROUND(365*'Farrow Input'!E34*'Farrow Input'!M34/1000*'Farrow Input'!E23/'Farrow Input'!E22,2)","v":6.25}]
[null,"","","1.04","Creep Feed",null,null,{"$f":"ROUND('Farrow Input'!E35*'Farrow Input'!M35/1000*'Farrow Input'!F25*'Farrow Input'!G13,2)","v":29039.62},{"$f":"ROUND(J12/'Farrow Input'!$G$79,2)","v":2.23},{"$f":"ROUND('Farrow Input'!E35*'Farrow Input'!M35/1000*'Farrow Input'!F25,2)","v":58.08}]
[null,"","","1.05","Starter Ration #1",null,null,{"$f":"ROUND('Farrow Input'!E36*'Farrow Input'!M36/1000*'Farrow Input'!F29*'Farrow Input'!G13,2)","v":98179.81},{"$f":"ROUND(J13/'Farrow Input'!$G$79,2)","v":7.55},{"$f":"ROUND('Farrow Input'!E36*'Farrow Input'!M36/1000*'Farrow Input'!F29,2)","v":196.36}]
[null,null,null,"1.05","Starter Ration #2",null,null,{"$f":"ROUND('Farrow Input'!E37*'Farrow Input'!M37/1000*'Farrow Input'!F29*'Farrow Input'!G13,2)","v":234446.19},{"$f":"ROUND(J14/'Farrow Input'!$G$79,2)","v":18.03},{"$f":"ROUND('Farrow Input'!E37*'Farrow Input'!M37/1000*'Farrow Input'!F29,2)","v":468.89}]
[null,"","","","","","","===================================="]
{"$rows_left_out":49}
{"sheet":"Ingredient-Summary","index":10,"n_rows":72,"n_cols":8,"rows_kept":72,"cut":false,"hidden":false,"merged":[[23,1,23,8],[2,1,2,8]]}
[]
[]
[null,"  Summary of Purchased Feeds Used"]
[]
[null,null,"Farrow finish ",null,{"$f":"'Farrow Input'!G13","v":500},"sows"]
[null,null,"Total sold",null,{"$f":"'Farrow Input'!F79","v":13001.8212},"pigs sold"]
[]
[null,null,null,null,"Total","Total","Total","Total"]
[null,null,null,null,"per Year","per Month","per Pig","per Pig"]
[null,null,null,null,"(tonnes)","(tonnes)","(kgs)","(lbs)"]
[]
[null,{"$f":"'Farrow Input'!A32","v":"Dry Sow Ration"},null,null,{"$f":"IF('Farrow Input'!G32<=0,0,(('Farrow Input'!E32*'Farrow Finish Worksheet'!D30)*E5)/1000)","v":464.65449999999998},{"$f":"E12/12","v":38.72120833333333},{"$f":"E12/$E$6*1000","v":35.737647276675361},{"$f":"G12*2.2046","v":78.7872171861585}]
[null,{"$f":"'Farrow Input'!A33","v":"Nursing Sow Ration"},null,null,{"$f":"IF('Farrow Input'!G33<=0,0,(('Farrow Input'!E33*'Farrow Finish Worksheet'!D11)*E5)/1000)","v":163.18469999999999},13.598725,12.550910944691347,27.669738268666546]
[null,{"$f":"'Farrow Input'!A34","v":"Boar Ration"},null,null,{"$f":"IF('Farrow Input'!G34<=0,0,(('Farrow Input'!E34*'Farrow Finish Worksheet'!D37)*'Farrow Input'!E23)/1000)","v":3.2850000000000001},0.27374999999999999,0.2526569124023948,0.55700742908231959]
[null,{"$f":"'Farrow Input'!A35","v":"Per Starter 1(Ration 1)"},null,null,{"$f":"IF('Farrow Input'!G35<=0,0,('Farrow Input'!E35*'Farrow Input'!E27)/1000)","v":8.15306},0.6794216666666667,0.62707061376909257,1.3824398751153415]
{"$rows_left_out":57}